{"text_format":"1","workbook":"xlsx","n_sheets":7,"sheets":["Disclaimer","C264 CORTEC","Configurator","Master Text","Change Log","Database","Tendering"],"not_rendered":{"charts":0,"images":4,"macros":1,"external_links":0,"defined_names":57,"comments":2,"pivot_tables":0},"unopened":[],"bounds":{"document_bytes":16777216,"sheet_cells":100000,"rows_first":2000,"rows_last":500,"rows_between":2000,"halvings":0,"cell_chars":16384,"cell_head_chars":4096},"cells_cut":0,"cells_raw":0,"read":"whole","date_system":"1900"}

{"sheet":"Disclaimer","index":0,"n_rows":8,"n_cols":2,"rows_kept":8,"cut":false,"hidden":false,"merged":[[4,1,4,9],[7,1,9,9],[5,1,6,9]]}
[]
[]
[]
[]
[null,"Our policy is one of continuous development. Accordingly the design of our products may change at any time. "]
[null,"Whilst every effort is made to produce up to date literature, this document should only be regarded as a guide and is intended for information purposes only."]
[]
[null,"Its contents do not constitute an offer for sale or advice on the application of any product referred to in it. We cannot be held responsible for any reliance on any decisions taken on its contents without specific advice."]

{"sheet":"C264 CORTEC","index":1,"n_rows":257,"n_cols":62,"rows_kept":257,"cut":false,"hidden":false,"merged":[]}
["MiCOM C264 CORTEC FOR C264-V3/V4,  fully assembled device",null,null,null,null,null,null,null,null,null,null,null,null,null,null,null,null,null,null,null,null,null,null,null,null,null,null,null,null,null,null,null,null,null,null,null,null,null,null,null,null,null,null,null,null,null,null,null,null,null,null,null,null,null,null,null,null,null,null,null,"Version:","V3_24.11"]
["Variants",null,null,null,null,null,null,null,null,null,null,null,null,null,null,null,null,null,null,null,null,null,null,null,null,null,null,null,null,null,null,null,null,null,null,null,null,null,null,null,null,null,null,null,null,null,null,null,null,null,null,null,null,null,null,null,null,null,null,null,null,"Notes /"]
[null,null,"Order N°",null,null,null,null,null,null,null,null,null,null,null,null,null,null,null,null,null,null,null,null,null,null,null,null,null,null,null,null,null,null,null,null,null,null,null,null,null,null,null,null,null,null,null,null,null,null,null,null,null,null,null,null,null,null,null,null,null,null,"Ext. N°"]
["MiCOM C264C/C264 - Modular Computer for Bay Controller, RTU, PLC application",null,null,null,null,null,null,null,"rack",null,"GHU",null,"lang",null,"P.S",null,"biu serial",null,"cpu",null,"cpu serial",null,null,null,"Tropical",null,"TMU",null,"Voltage",null,"DIU200",null,"DIU211",null,"DOU",null,"CCU",null,"AIU201",null,null,"AIU211",null,"AOU",null,"SW",null,null,null,null,null,"SBU200",null,"Isagraf",null,"Soft",null,"Built in",null,"detach "]
[null,"MiCOM C","2",null,"6",null,"4",null,null,null,null,null,null,null,null,null,null,null,"9",null,null,null,"0",null,null,null,null,null,null,null,null,null,null,null,null,null,null,null,null,null,null,null,null,null,null,null,null,"1",null,"1"]
["CORTEC CODE Synthesis (for export to Word Docs) :"]
[null,{"$f":"CONCATENATE(CONCATENATE(B$5,C$5,E$5,G$5,I$5,K$5,M$5,O$5,Q$5,S$5,U$5,W$5,Y$5,AA$5,AC$5,AE$5,AG$5,AI$5,AK$5,AM$5,AP$5,AR$5,AT$5,AV$5,AX$5,AZ$5,BB$5,BD$5,BF$5), BH$5)","v":"MiCOM C2649011"}]
["Basic Model and Components"]
["Package rack 4U (CAS2xx) + FBP2xx"]
[null,"Case 40 T for use wo. CT/VT (Compact size), IP52, pin-terminal connection, 6 slots  1) ",null,null,null,null,null,null,"C",null,null,null,null,null,null,null,null,null,null,null,null,null,null,null,null,null,null,null,null,null,null,null,null,null,null,null,null,null,null,null,null,null,null,null,null,null,null,null,null,null,null,null,null,null,null,null,null,null,null,null,null,"1)"]
[null,"Case 40 T for use with CT/VT (Compact size), IP52, pin-terminal connection, 4 slots 1) ",null,null,null,null,null,null,"S",null,null,null,null,null,null,null,null,null,null,null,null,null,null,null,null,null,null,null,null,null,null,null,null,null,null,null,null,null,null,null,null,null,null,null,null,null,null,null,null,null,null,null,null,null,null,null,null,null,null,null,null,"1)"]
[null,"Case 80 T for use without CT/VT (Medium size), IP20, pin-terminal connection, 15 slots 1) ",null,null,null,null,null,null,"L",null,null,null,null,null,null,null,null,null,null,null,null,null,null,null,null,null,null,null,null,null,null,null,null,null,null,null,null,null,null,null,null,null,null,null,null,null,null,null,null,null,null,null,null,null,null,null,null,null,null,null,null,"1)"]
[null,"Case 80 T for use with CT/VT (Medium size), IP20, pin-terminal connection, 14 slots 1) ",null,null,null,null,null,null,"M",null,null,null,null,null,null,null,null,null,null,null,null,null,null,null,null,null,null,null,null,null,null,null,null,null,null,null,null,null,null,null,null,null,null,null,null,null,null,null,null,null,null,null,null,null,null,null,null,null,null,null,null,"1) "]
[null,"Case 60 T for use without CT/VT (Medium size), IP20, pin-terminal connection, 10 slots 1) ",null,null,null,null,null,null,"T",null,null,null,null,null,null,null,null,null,null,null,null,null,null,null,null,null,null,null,null,null,null,null,null,null,null,null,null,null,null,null,null,null,null,null,null,null,null,null,null,null,null,null,null,null,null,null,null,null,null,null,null,"1)"]
[null,"Case 60 T for use with CT/VT (Medium size), IP20, pin-terminal connection, 9 slots 1) ",null,null,null,null,null,null,"U",null,null,null,null,null,null,null,null,null,null,null,null,null,null,null,null,null,null,null,null,null,null,null,null,null,null,null,null,null,null,null,null,null,null,null,null,null,null,null,null,null,null,null,null,null,null,null,null,null,null,null,null,"1)"]
["Front panel (GHU2xx) - Schneider Electric"]
[null,"Front Panel Leds and L/R switch - IP52 protection - GHU210 (40TE) or GHU211(80TE) or GHU212(60TE)",null,null,null,null,null,null,null,null,"0",null,null,null,null,null,null,null,null,null,null,null,null,null,null,null,null,null,null,null,null,null,null,null,null,null,null,null,null,null,null,null,null,null,null,null,null,null,null,null,null,null,null,null,null,null,null,null,null,null,null,"New GHU212 60TE! Generally available"]
[null,"Front Panel with Leds + Graphic Display LCD + L/R switch -GHU200(40TE)or GHU201(80TE) or GHU202(60TE) - IP52 prot.",null,null,null,null,null,null,null,null,"1"]
[null,"Simple Blind front panel : GHU220 (40TE) or GHU221(80TE) or GHU222 (60TE)  12)",null,null,null,null,null,null,null,null,"2",null,null,null,null,null,null,null,null,null,null,null,null,null,null,null,null,null,null,null,null,null,null,null,null,null,null,null,null,null,null,null,null,null,null,null,null,null,null,null,null,null,null,null,null,null,null,null,null,null,null,"New GHU222 60TE! Generally available"]
[null,"Detachable Front Panel with Graphic Display 40TE (GHU200) + Simple Blind Front panel (GHU22x)  12) ",null,null,null,null,null,null,null,null,"3",null,null,null,null,null,null,null,null,null,null,null,null,null,null,null,null,null,null,null,null,null,null,null,null,null,null,null,null,null,null,null,null,null,null,null,null,null,null,null,null,null,null,null,null,null,null,null,null,null,"Select the cable lenght"]
{"$rows_left_out":238}
{"sheet":"Configurator","index":2,"n_rows":62,"n_cols":30,"rows_kept":62,"cut":false,"hidden":false,"merged":[[2,0,2,2],[22,0,22,2],[26,7,26,16]]}
[null,null,null,null,null,null,null,null,null,null,null,null,null,null,null,null,null,null,null,null,null,null,null,null,null,null,null,"+AC:AC","+AC:AC","+AC:AC"]
["Order form configurator\nMiCOM C264\nReady-to-use configuration",null,null,null,"rack","GHU","lang","P.S","biu serial","cpu","biu serial",null,"Tropical","TMU","Voltage","DIU200","DIU211","DOU","CCU","AIU201","AIU211","AOU","SW",null,null,"IED/SBU200","ISaGRAF","Soft","Built In","detach"]
["Modular Computer for Bay Controller, RTU, PLC application",null,null,"C264",{"$f":"VLOOKUP(Tendering!$B$9,Database!$A$2:$C$7,3,FALSE)","v":"M"},{"$f":"VLOOKUP(Tendering!$B$10,Database!$A$9:$C$15,3,FALSE)","v":3},{"$f":"VLOOKUP(Tendering!$B$11,Database!$A$17:$C$20,3,FALSE)","v":1},{"$f":"VLOOKUP(Tendering!$B$13,Database!$A$24:$C$27,3,FALSE)","v":"A"},{"$f":"VLOOKUP(Tendering!$B$14,Database!$A$29:$C$31,3,FALSE)","v":1},{"$f":"VLOOKUP(Tendering!$B$15,Database!$A$33:$C$35,3,FALSE)","v":"9"},{"$f":"VLOOKUP(Tendering!$B$16,Database!$A$37:$C$39,3,FALSE)","v":1},0,{"$f":"VLOOKUP(Tendering!$B$18,Database!$A$41:$C$42,3,FALSE)","v":1},{"$f":"VLOOKUP(Tendering!$B$20,Database!$A$49:$C$62,3,FALSE)","v":"1"},{"$f":"VLOOKUP(Tendering!$B$21,Database!$A$64:$C$71,3,FALSE)","v":0},{"$f":"VLOOKUP(Tendering!$B$22,Database!$A$73:$C$88,3,FALSE)","v":1},{"$f":"VLOOKUP(Tendering!$B$23,Database!$A$90:$C$105,3,FALSE)","v":"1"},{"$f":"VLOOKUP(Tendering!$B$24,Database!$A$107:$C$122,3,FALSE)","v":"1"},{"$f":"VLOOKUP(Tendering!$B$25,Database!$A$124:$C$139,3,FALSE)","v":0},{"$f":"VLOOKUP(Tendering!$B$26,Database!$A$141:$C$147,3,FALSE)","v":"2"},{"$f":"VLOOKUP(Tendering!$B$27,Database!$A$152:$C$158,3,FALSE)","v":"B"},{"$f":"VLOOKUP(Tendering!$B$28,Database!$A$163:$C$167,3,FALSE)","v":"1"},{"$f":"VLOOKUP(Tendering!$B$29,Database!$A$175:$C$186,3,FALSE)","v":0},1,1,{"$f":"VLOOKUP(Tendering!$B$32,Database!$A$188:$C$197,3,FALSE)","v":1},{"$f":"VLOOKUP(Tendering!$B$33,Database!$A$199:$C$200,3,FALSE)","v":0},{"$f":"VLOOKUP(Tendering!$B$34,Database!$A$202:$C$205,3,FALSE)","v":"N"},{"$f":"VLOOKUP(Tendering!$B$35,Database!$A$207:$C$211,3,FALSE)","v":"S"},{"$f":"VLOOKUP(Tendering!$B$36,Database!$A$213:$C$214,3,FALSE)","v":0}]
["SAP PART NUMBER"]
["Basic Model and Components"]
["Package rack 4U (CAS2xx) + FBP2xx"]
[]
["Front panel (GHU2xx) - Schneider Electric"]
[]
["Language (including: Front panel labels, HMI)"]
[]
["Power supply and legacy ports (BIUxxx)"]
[]
[]
[{"$f":"IF(Database!$D$22=1,\"Factory setted legacy ports: port No.1 and No.2 on BIU241 board\",\"Factory setted legacy ports: port No.2 on BIU261 board\")","v":"Factory setted legacy ports: port No.1 and No.2 on BIU241 board"}]
[]
["CPU and Base Communications (CPU2x0)"]
["CPU270(Type3), with 2*Ethernet RJ45, 64Mb FlashMemory, 50ppm Oscillator accuracy"]
["For CPU with 2 serial links: Factory setted legacy ports No. 3/4"]
[]
{"$rows_left_out":43}
{"sheet":"Master Text","index":3,"n_rows":62,"n_cols":1,"rows_kept":62,"cut":false,"hidden":false,"merged":[[27,0,27,3],[29,0,29,3],[31,0,31,3],[15,0,15,3],[5,0,5,3],[7,0,7,3],[9,0,9,3],[11,0,11,3],[13,0,13,3],[18,0,18,3],[23,0,23,3],[25,0,25,3],[53,0,53,3],[56,0,56,3],[58,0,58,3],[33,0,33,3],[35,0,35,3],[37,0,37,3],[39,0,39,3],[41,0,41,3],[43,0,43,3]]}
[{"$f":"CONCATENATE(Configurator!$D$3,Configurator!$E$3,Configurator!$F$3,Configurator!$G$3,Configurator!$H$3,Configurator!$I$3,Configurator!$J$3,Configurator!$K$3,Configurator!$L$3,Configurator!$M$3,Configurator!$N$3,Configurator!$O$3,Configurator!$P$3,Configurator!$Q$3,Configurator!$R$3,Configurator!$S$3,Configurator!$T$3,Configurator!$U$3,Configurator!$V$3,Configurator!$W$3,Configurator!$X$3,Configurator!$Y$3,Configurator!$Z$3,Configurator!$AA$3,Configurator!$AB$3,Configurator!$AC$3,Configurator!$AD$3)","v":"C264M31A191011011102B101110NS0"}]
[]
[{"$f":"Configurator!A3","v":"Modular Computer for Bay Controller, RTU, PLC application"}]
[]
["Basic Model and Components"]
[{"$f":"CONCATENATE(Configurator!$A$6,\" : \")","v":"Package rack 4U (CAS2xx) + FBP2xx : "}]
[{"$f":"CONCATENATE(\" \",VLOOKUP(Tendering!$B$9,Database!$A$2:$B$7,2,FALSE))","v":" Case 80 T for use with. CT/VT (Medium Size), IP20, pin-terminal connection, 14 slots"}]
[{"$f":"CONCATENATE(Configurator!$A$8,\" : \")","v":"Front panel (GHU2xx) - Schneider Electric : "}]
[{"$f":"CONCATENATE(\" \",VLOOKUP(Tendering!$B$10,Database!$A$9:$B$15,2,FALSE))","v":" Detachable Front Panel with Graphic Display 40TE (GHU200) + Simple Blind Front panel (GHU22x)"}]
[{"$f":"CONCATENATE(Configurator!$A$10,\" : \")","v":"Language (including: Front panel labels, HMI) : "}]
[{"$f":"CONCATENATE(\" \",VLOOKUP(Tendering!$B$11,Database!$A$17:$B$20,2,FALSE))","v":" English (English)"}]
[{"$f":"CONCATENATE(Configurator!$A$12,\", \",VLOOKUP(Tendering!$AJ$12,Database!$A$22:$B$23,2,FALSE),\" : \")","v":"Power supply and legacy ports (BIUxxx), about BIU241 : Vn +/- 20% - 2DI/2DO - 2*serial Ports (port no1 and port no2) : "}]
[{"$f":"CONCATENATE(\" \",VLOOKUP(Tendering!$B$13,Database!$A$24:$B$27,2,FALSE))","v":" BIU241-A01 : Va,nom 24Vdc / Nominal voltage for 2DI:24Vdc"}]
[{"$f":"CONCATENATE(Configurator!$A$15,\" : \")","v":"Factory setted legacy ports: port No.1 and No.2 on BIU241 board : "}]
[{"$f":"CONCATENATE(\" \",VLOOKUP(Tendering!$B$14,Database!$A$29:$B$31,2,FALSE))","v":" Port No.2 RS232 ; Port No.1 RS232"}]
[{"$f":"CONCATENATE(Configurator!$A$17,\" : \")","v":"CPU and Base Communications (CPU2x0) : "}]
[{"$f":"CONCATENATE(\" \",\"Power PC processor board with Ethernet port(s), 2 serial links, IRIGB input- CPU260-based\")","v":" Power PC processor board with Ethernet port(s), 2 serial links, IRIGB input- CPU260-based"}]
[{"$f":"CONCATENATE(\" \",Configurator!$A$18)","v":" CPU270(Type3), with 2*Ethernet RJ45, 64Mb FlashMemory, 50ppm Oscillator accuracy"}]
[{"$f":"CONCATENATE(Configurator!$A$19,\" : \")","v":"For CPU with 2 serial links: Factory setted legacy ports No. 3/4 : "}]
[{"$f":"CONCATENATE(\" \",VLOOKUP(Tendering!$B$16,Database!$A$37:$B$39,2,FALSE))","v":" Port No.3: RS232 (non isolated) ; Port No.4 RS232 (non isolated)"}]
{"$rows_left_out":43}
{"sheet":"Change Log","index":4,"n_rows":3,"n_cols":2,"rows_kept":3,"cut":false,"hidden":false,"merged":[]}
["2015-03-25","Original"]
["2017-07-05","CPU 275 added"]
["2017-07-05","SBU200 added"]

{"sheet":"Database","index":5,"n_rows":214,"n_cols":37,"rows_kept":214,"cut":false,"hidden":true,"merged":[]}
[]
[1,"Case 40 T for use wo. CT/VT (Compact Size), IP52, pin-terminal connection, 6 slots","C"]
[2,"Case 40 T for use with. CT/VT (Compact Size), IP52, pin-terminal connection, 4 slots","S"]
[3,"Case 80 T for use wo. CT/VT (Medium Size), IP20, pin-terminal connection, 15 slots","L"]
[4,"Case 80 T for use with. CT/VT (Medium Size), IP20, pin-terminal connection, 14 slots","M"]
[5,"Case 60 T for use wo. CT/VT (Medium Size), IP20, pin-terminal connection, 10 slots","T"]
[6,"Case 60 T for use with. CT/VT (Medium Size), IP20, pin-terminal connection, 9 slots","U"]
[]
[1,"Front Panel, Leds and L/R switch - IP52 protection - GHU210(40TE) or GHU211(80TE) or GHU212(60TE)",0]
[2,"Front Panel with Leds + Graphic Display LCD + L/R switch - GHU200(40TE) or GHU201(80TE) or GHU202(60TE)- IP52 prot",1]
[3,"Simple Blind front panel : GHU220 (40TE) or GHU221 (80TE) or GHU222 (60TE)",2]
[4,{"$f":"IF(Tendering!$B$9>4,\"\",Database!$E12)","v":"Detachable Front Panel with Graphic Display 40TE (GHU200) + Simple Blind Front panel (GHU22x)"},{"$f":"IF(Tendering!$B$9>4,2,Database!$O12)","v":3},null,"Detachable Front Panel with Graphic Display 40TE (GHU200) + Simple Blind Front panel (GHU22x)",null,null,null,null,null,null,null,null,null,3]
[5,{"$f":"IF(Tendering!$B$9>4,\"\",Database!$E13)","v":"Detachable Front Panel with Graphic Display 80TE (GHU201) + Simple Blind Front panel (GHU22x)"},{"$f":"IF(Tendering!$B$9>4,2,Database!$O13)","v":4},null,"Detachable Front Panel with Graphic Display 80TE (GHU201) + Simple Blind Front panel (GHU22x)",null,null,null,null,null,null,null,null,null,4]
[6,{"$f":"IF(Tendering!$B$9>4,\"\",Database!$E14)","v":"Detachable Front Panel with Leds 40TE (GHU210) + Simple Blind Front panel (GHU22x)"},{"$f":"IF(Tendering!$B$9>4,2,Database!$O14)","v":5},null,"Detachable Front Panel with Leds 40TE (GHU210) + Simple Blind Front panel (GHU22x)",null,null,null,null,null,null,null,null,null,5]
[7,{"$f":"IF(Tendering!$B$9>4,\"\",Database!$E15)","v":"Detachable Front Panel with Leds 80TE (GHU211) + Simple Blind Front panel (GHU22x)"},{"$f":"IF(Tendering!$B$9>4,2,Database!$O15)","v":6},null,"Detachable Front Panel with Leds 80TE (GHU211) + Simple Blind Front panel (GHU22x)",null,null,null,null,null,null,null,null,null,6]
[]
[1,"French (English)",0]
[2,"English (English)",1]
[3,"Spanish (English)",2]
[4,"German (English)",3]
{"$rows_left_out":195}
{"sheet":"Tendering","index":6,"n_rows":36,"n_cols":36,"rows_kept":36,"cut":false,"hidden":false,"merged":[[11,0,12,0],[18,0,19,0]]}
[null,null,{"$f":"IF(C3<>\"\",COLUMN(C:C)-2,\"\")","v":1},2,3,4,5,6,7,8,9,10,11,12,13,14,15,16,17,18,19,20,21,22,23,24,25,26,27,{"$f":"IF(AD3<>\"\",COLUMN(AD:AD)-2,\"\")","v":28},{"$f":"IF(AE3<>\"\",COLUMN(AE:AE)-2,\"\")","v":29},{"$f":"IF(AF3<>\"\",COLUMN(AF:AF)-2,\"\")","v":30},{"$f":"IF(AG3<>\"\",COLUMN(AG:AG)-2,\"\")","v":""},{"$f":"MAX(C1:AG1,AI1)","v":31},{"$f":"MAX(AI5:AI30)+1","v":31}]
["Cortec Landing cell :","C264S11I6910111031000031111T10",{"$f":"MID($B$2,COLUMN(C:C)-2,1)","v":"C"},"2","6","4","S","1","1","I","6","9","1","0","1","1","1","0","3","1","0","0","0","0","3","1","1","1","1","T","1","0","",""]
["Configurator feedback :",{"$f":"C3&D3&E3&F3&G3&H3&I3&J3&K3&L3&M3&N3&O3&P3&Q3&R3&S3&T3&U3&V3&W3&X3&Y3&Z3&AA3&AB3&AC3&AD3&AE3&AF3","v":"C264M31A191011011102B101110NS0"},{"$f":"+C5&C6&C7&C8&C9&C13&C11&C15&C12&C14&C18&C16&C10&C17&C19&C20&C21&C22&C23&C24&C25&C26&C27&C28&C29&C30&C31&C32&C33&C34&C35&C36","v":"C"},{"$f":"+D5&D6&D7&D8&D9&D13&D11&D15&D12&D14&D18&D16&D10&D17&D19&D20&D21&D22&D23&D24&D25&D26&D27&D28&D29&D30&D31&D32&D33&D34&D35&D36","v":"2"},"6","4","M","3","1","A","1","9","1","0","1","1","0","1","1","1","0","2","B","1","0","1","1","1","0","N","S","0",{"$f":"+AG5&AG6&AG7&AG8&AG9&AG13&AG11&AG15&AG12&AG14&AG18&AG16&AG10&AG17&AG19&AG20&AG21&AG22&AG23&AG24&AG25&AG26&AG27&AG28&AG29&AG30","v":""},"double digit in same row"]
[null,0]
["Cortec digit control 1",null,"C",null,null,null,null,null,null,null,null,null,null,null,null,null,null,null,null,null,null,null,null,null,null,null,null,null,null,null,null,null,null,null,{"$f":"+IF(AND(ISBLANK(A5),ISBLANK(B5)),0,ROW(A5))","v":5}]
["Cortec digit control 2",null,null,2,null,null,null,null,null,null,null,null,null,null,null,null,null,null,null,null,null,null,null,null,null,null,null,null,null,null,null,null,null,null,{"$f":"+IF(AND(ISBLANK(A6),ISBLANK(B6)),0,ROW(A6))","v":6}]
["Cortec digit control 3",null,null,null,6,null,null,null,null,null,null,null,null,null,null,null,null,null,null,null,null,null,null,null,null,null,null,null,null,null,null,null,null,null,7]
["Cortec digit control 4",null,null,null,null,4,null,null,null,null,null,null,null,null,null,null,null,null,null,null,null,null,null,null,null,null,null,null,null,null,null,null,null,null,8]
["Rack",4,null,null,null,null,{"$f":"IF(OR(ISERR(Configurator!E$3),ISNA(Configurator!E$3)),\"_\",Configurator!E$3)","v":"M"},null,null,null,null,null,null,null,null,null,null,null,null,null,null,null,null,null,null,null,null,null,null,null,null,null,null,null,9]
["GHU",4,null,null,null,null,null,{"$f":"IF(OR(ISERR(Configurator!F$3),ISNA(Configurator!F$3)),\"_\",Configurator!F$3)","v":3},null,null,null,null,null,null,null,null,null,null,null,null,null,null,null,null,null,null,null,null,null,null,null,null,null,null,10]
["Lang",2,null,null,null,null,null,null,{"$f":"IF(OR(ISERR(Configurator!G$3),ISNA(Configurator!G$3)),\"_\",Configurator!G$3)","v":1},null,null,null,null,null,null,null,null,null,null,null,null,null,null,null,null,null,null,null,null,null,null,null,null,null,11]
["P.S.",null,null,null,null,null,null,null,null,null,null,null,null,null,null,null,null,null,null,null,null,null,null,null,null,null,null,null,null,null,null,null,null,null,12,1]
[null,1,null,null,null,null,null,null,null,{"$f":"IF(OR(ISERR(Configurator!H$3),ISNA(Configurator!H$3)),\"_\",Configurator!H$3)","v":"A"},null,null,null,null,null,null,null,null,null,null,null,null,null,null,null,null,null,null,null,null,null,null,null,null,13]
["Biu Serial",1,null,null,null,null,null,null,null,null,{"$f":"IF(OR(ISERR(Configurator!I$3),ISNA(Configurator!I$3)),\"_\",Configurator!I$3)","v":1},null,null,null,null,null,null,null,null,null,null,null,null,null,null,null,null,null,null,null,null,null,null,null,14]
["CPU",1,null,null,null,null,null,null,null,null,null,{"$f":"IF(OR(ISERR(Configurator!J$3),ISNA(Configurator!J$3)),\"_\",Configurator!J$3)","v":"9"},null,null,null,null,null,null,null,null,null,null,null,null,null,null,null,null,null,null,null,null,null,null,15]
["CPU serial",1,null,null,null,null,null,null,null,null,null,null,{"$f":"IF(OR(ISERR(Configurator!K$3),ISNA(Configurator!K$3)),\"_\",Configurator!K$3)","v":1},null,null,null,null,null,null,null,null,null,null,null,null,null,null,null,null,null,null,null,null,null,16]
["Constant",null,null,null,null,null,null,null,null,null,null,null,null,{"$f":"IF(OR(ISERR(Configurator!L$3),ISNA(Configurator!L$3)),\"_\",Configurator!L$3)","v":0},null,null,null,null,null,null,null,null,null,null,null,null,null,null,null,null,null,null,null,null,17]
["Tropical",2,null,null,null,null,null,null,null,null,null,null,null,null,{"$f":"IF(OR(ISERR(Configurator!M$3),ISNA(Configurator!M$3)),\"_\",Configurator!M$3)","v":1},null,null,null,null,null,null,null,null,null,null,null,null,null,null,null,null,null,null,null,18]
["TMU",null,null,null,null,null,null,null,null,null,null,null,null,null,null,null,null,null,null,null,null,null,null,null,null,null,null,null,null,null,null,null,null,null,19,2]
[null,1,null,null,null,null,null,null,null,null,null,null,null,null,null,{"$f":"IF(OR(ISERR(Configurator!N$3),ISNA(Configurator!N$3)),\"_\",Configurator!N$3)","v":"1"},null,null,null,null,null,null,null,null,null,null,null,null,null,null,null,null,null,null,20]
{"$rows_left_out":16}